{"text_format":"1","workbook":"xlsx","n_sheets":7,"sheets":["zászlók","memo","Munka1","Előir.vált.","Bevételek","Kiadások","Részarány"],"not_rendered":{"charts":0,"images":2,"macros":1,"external_links":0,"defined_names":6,"comments":1,"pivot_tables":0},"unopened":[],"bounds":{"document_bytes":16777216,"sheet_cells":100000,"rows_first":2000,"rows_last":500,"rows_between":2000,"halvings":0,"cell_chars":16384,"cell_head_chars":4096},"cells_cut":0,"cells_raw":0,"read":"whole","date_system":"1900"}

{"sheet":"zászlók","index":0,"n_rows":20,"n_cols":10,"rows_kept":20,"cut":false,"hidden":false,"merged":[]}
[]
[null,null,"Kérjük, válasszon nyelvet.",null,null,null,null,null,null,"Please, choose language."]
[]
[]
[]
[]
[]
[]
[]
[null,null,"Ha a nyelv kiválasztása nem működik, próbálkozzon",null,null,null,null,null,null," If you have any problem with choosing the language, "]
[null,null,"a lap biztonsági szintjének csökkentésével.",null,null,null,null,null,null," please try to reduce the security level."]
[]
[]
[]
[]
[]
[]
[]
[]
[2]
{"$rows_left_out":1}
{"sheet":"memo","index":1,"n_rows":41,"n_cols":26,"rows_kept":41,"cut":false,"hidden":true,"merged":[[36,2,37,3],[36,6,37,7]]}
[12,{"$f":"+CONCATENATE(\"2014. \",B4)","v":"2014. január-december"},{"$f":"+CONCATENATE(\"2013. \",C4,)","v":"2013. I-XII. hó"},{"$f":"+CONCATENATE(D4,\" 2013\")","v":"January-December 2013"},{"$f":"+CONCATENATE(\"2011\",E4,)","v":"2011.12.31."},{"$f":"+IF(H1<>I1,\"rossz fájl\",A1)","v":{"$error":"#REF!"}},null,{"$f":"+#REF!","v":{"$error":"#REF!"}},{"$f":"+#REF!","v":{"$error":"#REF!"}},null,null,null,null,{"$f":"SUM(M2:R4,M13:Q18)","v":{"$error":"#REF!"}}]
[null,null,{"$f":"+CONCATENATE(\"2014. \",C4,)","v":"2014. I-XII. hó"},{"$f":"+CONCATENATE(D4,\" 2014\")","v":"January-December 2014"},{"$f":"+CONCATENATE(\"2012\",E4,)","v":"2012.12.31."},"Kiadások össz",{"$f":"+Kiadások!D41","v":13550251.4},null,{"$f":"+Kiadások!E41","v":16135074.597901},null,{"$f":"+Kiadások!F41","v":3634077.0496290005},null,{"$f":"+IF(A21=0,G2-G15,G2-H15)","v":{"$error":"#REF!"}},{"$f":"+G2-G20","v":0},{"$f":"+I2-I15","v":{"$error":"#REF!"}},{"$f":"+I2-I20","v":0},{"$f":"+K2-K15","v":{"$error":"#REF!"}}," "]
[null,null,null,null,null,"Bevételek össz",{"$f":"+Bevételek!D41","v":2425833.8000000003},null,{"$f":"+Bevételek!E41","v":2610553.1452640002},null,{"$f":"+Bevételek!F41","v":633134.54129499989},null,{"$f":"+G3-G18","v":{"$error":"#REF!"}},{"$f":"+G3-G21","v":0},{"$f":"+I3-I18","v":{"$error":"#REF!"}},{"$f":"+I3-I21","v":0},{"$f":"+K3-K18","v":{"$error":"#REF!"}},{"$f":"+K3-K21","v":0}]
[null,{"$f":"VLOOKUP($A$1,A5:B16,2)","v":"január-december"},{"$f":"VLOOKUP($A$1,A5:C16,3)","v":"I-XII. hó"},{"$f":"+VLOOKUP($A$1,A5:D16,4,FALSE)","v":"January-December"},{"$f":"VLOOKUP($A$1,A5:E16,5)","v":".12.31."},"Előirányzat vált.",{"$f":"+'Előir.vált.'!E41","v":13550251.4},null,{"$f":"+'Előir.vált.'!F41","v":16135074.597901},null,null,null,{"$f":"+G4-G2","v":0},null,{"$f":"+I4-I2","v":0}]
[1,"január","I. hó","January",".01.31.","PMM3"]
[2,"január-február","I-II. hó","January-February",".02.29.","Kiadások össz",{"$f":"+#REF!","v":{"$error":"#REF!"}},{"$f":"+#REF!","v":{"$error":"#REF!"}},{"$f":"+#REF!","v":{"$error":"#REF!"}},{"$f":"+#REF!","v":{"$error":"#REF!"}},{"$f":"+#REF!","v":{"$error":"#REF!"}}]
[3,"január-március","I-III. hó","January-March",".03.31.",null,{"$f":"+#REF!+#REF!+#REF!+#REF!+#REF!+#REF!","v":{"$error":"#REF!"}},{"$f":"+#REF!+#REF!+#REF!+#REF!+#REF!+#REF!","v":{"$error":"#REF!"}},{"$f":"+#REF!+#REF!+#REF!+#REF!+#REF!+#REF!+#REF!","v":{"$error":"#REF!"}},{"$f":"+#REF!+#REF!+#REF!+#REF!+#REF!+#REF!","v":{"$error":"#REF!"}},{"$f":"VLOOKUP(\"026\",#REF!,9,FALSE)+VLOOKUP(\"067\",#REF!,9,FALSE)+VLOOKUP(\"069\",#REF!,9,FALSE)+VLOOKUP(\"072\",#REF!,9,FALSE)+VLOOKUP(\"073\",#REF!,9,FALSE)+VLOOKUP(\"075\",#REF!,9,FALSE)+VLOOKUP(\"081\",#REF!,9,FALSE)-692","v":{"$error":"#REF!"}}]
[4,"január-április","I-IV. hó","January-April",".04.30.",null,{"$f":"+G6+G7","v":{"$error":"#REF!"}},{"$f":"+H6+H7","v":{"$error":"#REF!"}},{"$f":"+I6+I7","v":{"$error":"#REF!"}},{"$f":"+J6+J7","v":{"$error":"#REF!"}},{"$f":"+K6+K7","v":{"$error":"#REF!"}}]
[5,"január-május","I-V. hó","January-May",".05.31.","Bevételek össz",{"$f":"+#REF!","v":{"$error":"#REF!"}},{"$f":"+#REF!","v":{"$error":"#REF!"}},{"$f":"+#REF!","v":{"$error":"#REF!"}},{"$f":"+#REF!","v":{"$error":"#REF!"}},{"$f":"+#REF!","v":{"$error":"#REF!"}}]
[6,"január-június","I-VI. hó","January-June",".06.30.",null,{"$f":"+#REF!+#REF!+#REF!+#REF!+#REF!+#REF!+#REF!","v":{"$error":"#REF!"}},{"$f":"+#REF!+#REF!+#REF!+#REF!+#REF!+#REF!+#REF!","v":{"$error":"#REF!"}},{"$f":"+#REF!+#REF!+#REF!+#REF!+#REF!+#REF!+#REF!","v":{"$error":"#REF!"}},{"$f":"+#REF!+#REF!+#REF!+#REF!+#REF!+#REF!","v":{"$error":"#REF!"}},{"$f":"+VLOOKUP(\"068\",#REF!,9,FALSE)+VLOOKUP(\"071\",#REF!,9,FALSE)+VLOOKUP(\"074\",#REF!,9,FALSE)+VLOOKUP(\"076\",#REF!,9,FALSE)+VLOOKUP(\"079\",#REF!,9,FALSE)+VLOOKUP(\"080\",#REF!,9,FALSE)+VLOOKUP(\"082\",#REF!,9,FALSE)","v":{"$error":"#REF!"}}]
[7,"január-július","I-VII. hó","January-July",".07.31.",null,{"$f":"+G9+G10","v":{"$error":"#REF!"}},{"$f":"+H9+H10","v":{"$error":"#REF!"}},{"$f":"+I9+I10","v":{"$error":"#REF!"}},{"$f":"+J9+J10","v":{"$error":"#REF!"}},{"$f":"+K9+K10","v":{"$error":"#REF!"}}]
[8,"január-augusztus","I-VIII. hó","January-August",".08.31.","PM03"]
[9,"január-szeptember","I-IX. hó","January-September",".09.30.","Kiadások össz",{"$f":"+#REF!","v":{"$error":"#REF!"}},{"$f":"+#REF!","v":{"$error":"#REF!"}},{"$f":"+#REF!","v":{"$error":"#REF!"}},{"$f":"+#REF!","v":{"$error":"#REF!"}},{"$f":"+#REF!","v":{"$error":"#REF!"}},null,{"$f":"+G6-G13","v":{"$error":"#REF!"}},{"$error":"#REF!"},{"$error":"#REF!"},{"$error":"#REF!"},{"$error":"#REF!"}]
[10,"január-október","I-X. hó","January-October",".10.31.",null,{"$f":"#REF!+#REF!+#REF!+#REF!+#REF!+#REF!+#REF!","v":{"$error":"#REF!"}},{"$f":"#REF!+#REF!+#REF!+#REF!+#REF!+#REF!+#REF!","v":{"$error":"#REF!"}},{"$f":"#REF!+#REF!+#REF!+#REF!+#REF!+#REF!+#REF!","v":{"$error":"#REF!"}},{"$f":"+#REF!+#REF!+#REF!+#REF!+#REF!+#REF!","v":{"$error":"#REF!"}},{"$f":"+VLOOKUP(\"026\",#REF!,9,FALSE)+VLOOKUP(\"067\",#REF!,9,FALSE)+VLOOKUP(\"069\",#REF!,9,FALSE)+VLOOKUP(\"072\",#REF!,9,FALSE)+VLOOKUP(\"073\",#REF!,9,FALSE)+VLOOKUP(\"075\",#REF!,9,FALSE)+VLOOKUP(\"081\",#REF!,9,FALSE)-692","v":{"$error":"#REF!"}},null,{"$error":"#REF!"},{"$error":"#REF!"},{"$f":"+I7-I14","v":{"$error":"#REF!"}},{"$error":"#REF!"},{"$error":"#REF!"}]
[11,"január-november","I-XI. hó","January-November",".11.30.",null,{"$f":"+G13+G14","v":{"$error":"#REF!"}},{"$f":"+H13+H14","v":{"$error":"#REF!"}},{"$f":"+I13+I14","v":{"$error":"#REF!"}},{"$f":"+J13+J14","v":{"$error":"#REF!"}},{"$f":"+K13+K14","v":{"$error":"#REF!"}},null,{"$error":"#REF!"},{"$error":"#REF!"},{"$error":"#REF!"},{"$error":"#REF!"},{"$error":"#REF!"}]
[12,"január-december","I-XII. hó","January-December",".12.31.","Bevételek össz",{"$f":"+#REF!","v":{"$error":"#REF!"}},{"$f":"+#REF!","v":{"$error":"#REF!"}},{"$f":"+#REF!","v":{"$error":"#REF!"}},{"$f":"+#REF!","v":{"$error":"#REF!"}},{"$f":"+#REF!","v":{"$error":"#REF!"}},null,{"$f":"+G9-G16","v":{"$error":"#REF!"}},{"$error":"#REF!"},{"$error":"#REF!"},{"$f":"+J9-J16","v":{"$error":"#REF!"}},{"$f":"+K9-K16","v":{"$error":"#REF!"}}]
[null,null,null,null,null,null,{"$f":"+#REF!+#REF!+#REF!+#REF!+#REF!+#REF!","v":{"$error":"#REF!"}},{"$f":"+#REF!+#REF!+#REF!+#REF!+#REF!+#REF!","v":{"$error":"#REF!"}},{"$f":"+#REF!+#REF!+#REF!+#REF!+#REF!+#REF!","v":{"$error":"#REF!"}},{"$f":"+#REF!+#REF!+#REF!+#REF!+#REF!+#REF!","v":{"$error":"#REF!"}},{"$f":"+VLOOKUP(\"068\",#REF!,9,FALSE)+VLOOKUP(\"071\",#REF!,9,FALSE)+VLOOKUP(\"074\",#REF!,9,FALSE)+VLOOKUP(\"076\",#REF!,9,FALSE)+VLOOKUP(\"079\",#REF!,9,FALSE)+VLOOKUP(\"080\",#REF!,9,FALSE)+VLOOKUP(\"082\",#REF!,9,FALSE)","v":{"$error":"#REF!"}},null,{"$error":"#REF!"},{"$error":"#REF!"},{"$error":"#REF!"},{"$f":"+J10-J17","v":{"$error":"#REF!"}},{"$f":"+K10-K17","v":{"$error":"#REF!"}}]
[null,null,null,null,null,null,{"$f":"+G16+G17","v":{"$error":"#REF!"}},{"$f":"+H16+H17","v":{"$error":"#REF!"}},{"$f":"+I16+I17","v":{"$error":"#REF!"}},{"$f":"+J16+J17","v":{"$error":"#REF!"}},{"$f":"+K16+K17","v":{"$error":"#REF!"}},null,{"$error":"#REF!"},{"$error":"#REF!"},{"$error":"#REF!"},{"$f":"+J11-J18+R18","v":{"$error":"#REF!"}},{"$f":"+K11-K18+S18","v":{"$error":"#REF!"}}]
[null,null,null,null,null,"Részarány"]
[null,null,null,null,null,null,{"$f":"+Részarány!G27","v":13550251.4},null,{"$f":"+Részarány!H27","v":16135074.597901002},null,{"$f":"+Részarány!I25","v":3634077.049629}]
{"$rows_left_out":22}
{"sheet":"Munka1","index":2,"n_rows":168,"n_cols":16,"rows_kept":168,"cut":false,"hidden":true,"merged":[[157,1,157,7],[158,1,158,7],[159,1,159,7],[156,1,156,7]]}
[null,null,{"$f":"+IF(zászlók!$A$20=1,Munka1!C$3,Munka1!C$2)","v":"cumulated expenditures"},{"$f":"+IF(zászlók!$A$20=1,Munka1!D$3,Munka1!D$2)","v":"cumulated revenues"},{"$f":"+IF(zászlók!$A$20=1,Munka1!E$3,Munka1!E$2)","v":"monthly expenditures"},{"$f":"+IF(zászlók!$A$20=1,Munka1!F$3,Munka1!F$2)","v":"monthly revenues"},{"$f":"+IF(zászlók!$A$20=1,Munka1!G$3,Munka1!G$2)","v":"proportional expenditures"},{"$f":"+IF(zászlók!$A$20=1,Munka1!H$3,Munka1!H$2)","v":"proportional revenues"},null,{"$f":"+IF(zászlók!$A$20=1,Munka1!J$3,Munka1!J$2)","v":"expenditures"},{"$f":"+IF(zászlók!$A$20=1,Munka1!K$3,Munka1!K$2)","v":"revenues"},null,{"$f":"+memo!A1-1","v":11}]
[null,null,"cumulated expenditures","cumulated revenues","monthly expenditures","monthly revenues","proportional expenditures","proportional revenues",null,"expenditures","revenues",null,{"$f":"VLOOKUP(memo!$A$1-1,$L$136:$P$229,2,FALSE)","v":1787634.4270000011},{"$f":"VLOOKUP(memo!$A$1-1,$L$136:$P$229,3,FALSE)","v":853948.67599999998},{"$f":"VLOOKUP(memo!$A$1-1,$L$136:$P$229,4,FALSE)","v":763922.83600000013},{"$f":"VLOOKUP(memo!$A$1-1,$L$136:$P$229,5,FALSE)","v":169762.8820000001}]
[null,null,"Halmozott kiadás","Halmozott bevétel","Tárgyhavi kiadás (tényleges)","Tárgyhavi bevétel (tényleges)","Időarányos kiadás (számított)","Időarányos bevétel (számított)",null,"Kiadás","bevétel"]
[2003,"Jan",266862.8,43504.6,{"$f":"C4","v":266862.8},{"$f":"D4","v":43504.6},224969.9,45748.9,null,{"$f":"+G4*12","v":2699638.8},548986.80000000005,1]
[null,"Febr",471731.65298500011,83339.899999999994,{"$f":"C5-C4","v":204868.85298500012},39835.299999999996,{"$f":"2833476.6/12","v":236123.05000000002},{"$f":"593613.9/12","v":49467.825000000004},null,2833476.6,593613.9,2]
[null,"Márc",655713.5,135640.79999999999,183981.84701499989,52300.899999999994,{"$f":"2873703/12","v":239475.25},{"$f":"603767.3/12","v":50313.941666666673},null,2873703,603767.30000000005,3]
[null,"Ápr",887114.02131599991,183977,231400.52131599991,48336.200000000012,{"$f":"2904079.4/12","v":242006.61666666667},{"$f":"609824.2/12","v":50818.683333333327},null,2904079.4,609824.19999999995,4]
[null,"Máj",1085635.227185,220633.8,198521.20586900006,36656.799999999988,{"$f":"2943889.7/12","v":245324.14166666669},{"$f":"622133.2/12","v":51844.433333333327},null,2943889.7,622133.19999999995,5]
[null,"Jún",1326708.3495919998,269904.2,241073.12240699981,49270.400000000023,{"$f":"3029945.8/12","v":252495.48333333331},{"$f":"631141.3/12","v":52595.108333333337},null,3029945.8,631141.30000000005,6]
[null,"Júl",1587393.5138979997,326446.3,260685.16430599988,56542.099999999977,{"$f":"+J10/12","v":255837.51656399996},53209.372230666653,null,3070050.1987679997,638512.46676799981,7]
[null,"Aug",1794255.479151,365631.47368999996,206861.96525300038,39185.173689999967,258219.30738450005,53918.907967833329,null,3098631.6886140006,647026.89561399992,8]
[null,"Szept",2007883.320085,415105.86838200007,{"$f":"C12-C11","v":213627.84093399998},{"$f":"D12-D11","v":49474.394692000118},260128.85519025006,55021.800023583317,null,3121546.2622830006,660261.6002829998,9]
[null,"Okt",2250053.4826970003,467300.55689999997,235341.64938999945,52194.688517999894,263188.77908916661,56016.303089166664,null,3158265.3490699995,672195.63706999994,10]
[null,"Nov",2473541.2715980001,517429.47450600006,220873.56490100035,50128.91760600009,265537.46358566661,57491.165168999985,null,3186449.5630279994,689893.98202799982,11,551139.06302799995,150906.58202800003,364526.60400000005,35705.877000000008]
[null,"Dec",2753647.7,606787.58990800008,404736.51139299944,89358.115402000025,273413.63809650001,61319.294179833312,null,3280963.6571580004,735831.53015799972,12,639131.15715799993,196844.13015800001,424812.66,17474.367000000013]
[2004,"Jan",379009.03012499987,45829.545558999998,379009.03012499987,45829.545558999998,267237.17899574997,58578.116162416671,null,3206846.1479489999,702937.39394900005,1,96412.147948999904,11752.593948999984,84659.554000000018,3.637978807091713E-12]
[null,"Febr",586098.47395900008,94857.051829000018,207089.44383400021,49027.50627000002,272824.08138666669,61683.753886666665,null,3273888.9766400005,740205.04663999996,2,163454.97664000001,49020.246640000005,114354.73,80.000000000003638]
[null,"Márc",839552.06393900001,166966.83332000001,253453.58997999993,72109.781490999987,283965.56524741661,64976.021747416678,null,3407586.7829689994,779712.26096900017,3,297152.78296899993,88527.460968999978,208425.92199999999,199.4000000000168]
[null,"Ápr",1086749.1459530001,241522.24414199995,247197.08201400004,74555.410821999947,289130.49840491661,66794.509738249995,null,3469565.9808589993,801534.11685899994,4,359131.980859,110349.31685899996,246483.264,2299.4000000000315]
[null,"Máj",1326203.3873399999,318160.78613600001,239454.24138699984,76638.541994000057,291932.56920500001,67548.390455000015,null,3503190.8304599999,810580.68546000018,5,392756.83046000008,119395.88546000003,266686.7,6674.2450000000281]
{"$rows_left_out":149}
{"sheet":"Előir.vált.","index":3,"n_rows":45,"n_cols":10,"rows_kept":45,"cut":false,"hidden":false,"merged":[]}
[null,null,"Magyar Államkincstár",null,null,null,null,null,"3/2. számú melléklet"]
[null,null,null,null,null,"Központi költségvetési szervek és fejezeti kezelésű előirányzatok kiadási előirányzat-változásai "]
[null,null,null,null,null,"2026. február",null,null,null,"Millió forint"]
[null,"Hungarian State Treasury",null,null,null,null,null,null,null,"Appendix No. 3/2"]
[null,null,null,null,"Changes in spending appropriations of Central budgetary chapters"]
[null,null,null,null,"February 2026",null,null,null,null,"Million HUF"]
[null,null,"Fejezet","Eredeti\nelőirányzat","Törvénnyel\nmódosított\nelőirányzat","Módosított\nelőirányzat","Változás\n(6=5-4)",null,"V á l t o z á s"]
[null,null,null,null,null,null,null,"Többlet-\nbevételből","Előirányzat-\nmaradványból","Támoga-\ntásból"]
[null,"Chapter",null,"Approved appropriation","Amended appropriation","Current appropriation","Difference\n(5=4-3)",null,"Change"]
[null,null,null,null,null,null,null,"from additional income","from appropriation remained","from support"]
["1.","1.","2.","3.","4.","5.","6.","7.","8.","9."]
["I.","PARLIAMENT","ORSZÁGGYŰLÉS",197144.69999999998,197144.69999999998,223135.35203900002,25990.652039000037,87.924323000000001,22213.060509999999,3689.6672060000001]
["II.","PRESIDENCY","KÖZTÁRSASÁGI ELNÖKSÉG",6961.5,6961.5,6974.06,12.56,0,0,12.56]
["III.","CONSTITUTIONAL COURT","ALKOTMÁNYBÍRÓSÁG",4326.8999999999996,4326.8999999999996,5550.9,1224,0,0,1224]
["IV.","OFFICE OF THE COMMISSIONER FOR FUNDAMENTAL RIGHTS","ALAPVETŐ JOGOK BIZTOSÁNAK HIVATALA",3368.7,3368.7,3453.5375039999999,84.837503999999996,0,0,84.837503999999996]
["V.","STATE AUDIT OFFICE","ÁLLAMI SZÁMVEVŐSZÉK",19748.5,19748.5,19968.208262,219.70826199999999,0,0,219.70826199999999]
["VI.","COURTS","BÍRÓSÁGOK",218351,218351,229024.14068099999,10673.140681000001,35.746966,37.033607000000003,10600.360108000001]
["VII.","INTEGRITY AUTHORITY","INTEGRITÁS HATÓSÁG",14238.2,14238.2,14304.472,66.272000000000006,0,0,66.272000000000006]
["VIII.","PROSECUTION SERVICE ","ÜGYÉSZSÉG",94272.7,94272.7,103653.623186,9380.923186,0,2123.3790389999999,7257.5441469999996]
["X.","MINISTRY OF PUBLIC ADMINISTRATION AND JUSTICE","IGAZSÁGÜGYI MINISZTÉRIUM",39821,39821,30348.746241000001,-9472.2537589999993,46.870863999999997,398.58949200000001,-9917.7141150000007]
{"$rows_left_out":26}
{"sheet":"Bevételek","index":4,"n_rows":41,"n_cols":7,"rows_kept":41,"cut":false,"hidden":false,"merged":[]}
[null,null,"Magyar Államkincstár",null,null,null,"3/6. számú melléklet"]
[null,null,null,"Központi költségvetési szervek és fejezeti kezelésű előirányzatok bevételi előirányzatának és teljesítésének alakulása"]
[null,null,null,"2026. február"]
[null,"Hungarian State Treasury",null,null,null,null,"Millió forint"]
[null,null,null,null,null,null,"Appendix No. 3/6"]
[null,null,null,"Appropriations of revenues and performance of the Central budgetary chapters"]
[null,null,null,"(including current year's pending, overlapping, compensating and not identified revenues)"]
[null,null,null,"February 2026",null,null,"Million HUF"]
[null,null,"Fejezet","Eredeti  előirányzat","Módosított\nelőirányzat","Teljesítés\n2026. I-II. hó","Teljesítés/\nmódosított előirányzat (%)"]
[null,"Chapter",null,"Amended appropriation","Current appropriation","facts February 2026","Performance in % of current appropriation"]
["1.","1.","2.","3.","4.","5.","6.=5./4."]
["I.","PARLIAMENT","ORSZÁGGYŰLÉS",27060.3,27148.224323000002,6585.8856460000006,24.258992292252543]
["II.","PRESIDENCY","KÖZTÁRSASÁGI ELNÖKSÉG","0,0","0,0",79.566570999999996,0]
["III.","CONSTITUTIONAL COURT","ALKOTMÁNYBÍRÓSÁG","0,0","0,0",0.528142,0]
["IV.","OFFICE OF THE COMMISSIONER FOR FUNDAMENTAL RIGHTS","ALAPVETŐ JOGOK BIZTOSÁNAK HIVATALA","0,0","0,0",1.304303,0]
["V.","STATE AUDIT OFFICE","ÁLLAMI SZÁMVEVŐSZÉK",20,20,1.262624,6.3131199999999996]
["VI.","COURTS","BÍRÓSÁGOK",3069.1,3104.8469660000001,961.54368399999998,30.969116820555076]
["VII.","INTEGRITY AUTHORITY","INTEGRITÁS HATÓSÁG","0,0","0,0",-8.5450000000000005E-3,0]
["VIII.","PROSECUTION SERVICE ","ÜGYÉSZSÉG",102,102,17.846751999999999,17.496815686274509]
["X.","MINISTRY OF PUBLIC ADMINISTRATION AND JUSTICE","IGAZSÁGÜGYI MINISZTÉRIUM",150,196.87086400000001,211.74297200000001,107.5542453046785]
{"$rows_left_out":22}
{"sheet":"Kiadások","index":5,"n_rows":41,"n_cols":7,"rows_kept":41,"cut":false,"hidden":false,"merged":[]}
[null,null,"Magyar Államkincstár",null,null,null,"3/7. számú melléklet"]
[null,null,null,"Központi költségvetési szervek és fejezeti kezelésű előirányzatok kiadási előirányzatának és teljesítésének alakulása"]
[null,null,null,"2026. február"]
[null,"Hungarian State Treasury",null,null,null,null,"Millió forint"]
[null,null,null,null,null,null,"Appendix No. 3/7"]
[null,null,null,"Appropriations of expenditures and performance of the Central budgetary chapters"]
[null,null,null,"(including current year's pending, overlapping, compensating and not identified expenditures)"]
[null,null,null,"February 2026",null,null,"Million HUF"]
[null,null,"Fejezet","Eredeti előirányzat","Módosított\nelőirányzat","Teljesítés\n2026.I-II. hó","Teljesítés/\nmódosított előirányzat (%)"]
[null,"Chapter",null,"Amended appropriation","Current appropriation","facts February 2026","Performance in % of current appropriation"]
["1.","1.","2.","3.","4.","5.","6.=5./4."]
["I.","PARLIAMENT","ORSZÁGGYŰLÉS",197144.69999999998,223135.35203900002,62442.812811000003,27.984276019196692]
["II.","PRESIDENCY","KÖZTÁRSASÁGI ELNÖKSÉG",6961.5,6974.06,1195.277243,17.138901056199689]
["III.","CONSTITUTIONAL COURT","ALKOTMÁNYBÍRÓSÁG",4326.8999999999996,5550.9,676.94822799999997,12.195287755138807]
["IV.","OFFICE OF THE COMMISSIONER FOR FUNDAMENTAL RIGHTS","ALAPVETŐ JOGOK BIZTOSÁNAK HIVATALA",3368.7,3453.5375039999999,506.40028799999999,14.663234072699968]
["V.","STATE AUDIT OFFICE","ÁLLAMI SZÁMVEVŐSZÉK",19748.5,19968.208262,2745.1069109999999,13.747387221636739]
["VI.","COURTS","BÍRÓSÁGOK",218351,229024.14068099999,32145.344988000001,14.035788931427176]
["VII.","INTEGRITY AUTHORITY","INTEGRITÁS HATÓSÁG",14238.2,14304.472,865.921693,6.0535033589495653]
["VIII.","PROSECUTION SERVICE ","ÜGYÉSZSÉG",94272.7,103653.623186,12612.968757000001,12.168381933323074]
["X.","MINISTRY OF PUBLIC ADMINISTRATION AND JUSTICE","IGAZSÁGÜGYI MINISZTÉRIUM",39821,30348.746241000001,3559.2783199999999,11.72792540336164]
{"$rows_left_out":22}
{"sheet":"Részarány","index":6,"n_rows":55,"n_cols":15,"rows_kept":55,"cut":false,"hidden":false,"merged":[]}
[null,null,"Magyar Államkincstár",null,null,null,null,null,null,null,null,null,null,"3/8. számú melléklet"]
[null,null,null,null,null,null,null,"Központi költségvetési szervek és fejezeti kezelésű előirányzatok kiadásainak és bevételeinek alakulása kiemelt előirányzatonként "]
[null,null,"KIADÁS",null,null,null,null,null,null,null,null,null,null,"Millió forint"]
[null,"Hungarian State Treasury",null,null,null,null,null,null,null,null,null,null,null,"Appendix No. 3/8"]
[null,null,null,null,null,null,null,"Expenditures and revenues of the central budgetary chapters by enhanced appropriations"]
[null,"EXPENDITURES",null,null,null,null,null,null,null,null,null,null,null,"Million HUF"]
[null,null,null,"2025. évi ","2025. I-II. hó","2025. I-II. hó",null,null,"2026. I-II. hó","2026. I-II. hó",null,"2025. I-II. hó","2026. I-II. hó","2026. I-II. hó"]
["Rovat"]
["száma",null,"Megnevezés","módosított előirányzat","tény","részarány (%)","2025. évi eredeti előirányzat","2025. évi módosított előirányzat","tény","részarány (%)","tény/\nbázis\n(%)","tény/módosított előirányzat (%)\n  ","tény/eredeti előirányzat (%)","tény/módosított előirányzat (%)",{"$f":"+IF(zászlók!$A$20=1,\"11. számú melléklet\",\"Appendix No. 11\")","v":"Appendix No. 11"}]
[]
[null,null,null,null,"Feb 2025","Feb 2025",null,null,"Feb 2026","Feb 2026",null,"Feb 2025","Feb 2026","Feb 2026"]
[null,"Chapter",null,"2025. ",null,null,"2025.","2025.",null,null,null,"index (%)","index (%)","index (%)"]
[null,null,null,"current appropriation","performance","proportion","Amended appropriation","Current appropriaton","total performance","proportion \n(total performance) \n(%)","index (%) \n(total performance / base)\n","total performance/ \ncurrent appr.","total performance/\ncurrent appr.","total performance/\ncurrent appr."]
[null,"1.","1.","2.","3.","4.","5.","6.","7.","8.","9.=7./3.","10.=3./2.","11.=7./5.","12.=7./6."]
[11,"Labour allowances","Személyi juttatások (K1)",4758566.8021989996,726339.69929400005,34.502796530793219,4981663.4869820001,5650432.3801760003,1259364.2276290001,34.654307281612745,173.38501927584272,15.263833197809651,25.2799939401758,22.287926708889724,{"$f":"+IF(zászlók!$A$20=1,Részarány!C15,Részarány!B15)","v":"Labour allowances"}]
[12,"Employers' contribution and social contribution tax","Munkaadókat terhelő járulékok és szociális hozzájárulási adó (K2)",634575.49876999995,94816.358238999994,4.5039938189952107,652184.57230799994,751257.42584799998,151491.72122400001,4.1686436240933764,159.77382388188818,14.941698572160899,23.228350938736511,20.165088025985241,{"$f":"+IF(zászlók!$A$20=1,Részarány!C16,Részarány!B16)","v":"Employers' contribution and social contribution tax"}]
[13,"Real costs*1","Dologi kiadások (K3)",2867512.9371529999,256887.53756699999,12.202745421441014,2376651.974068,2968389.370689,235566.43447400001,6.4821529994266021,91.700218977170451,8.9585485121489938,9.9116924583111068,7.9358333781973531,{"$f":"+IF(zászlók!$A$20=1,Részarány!C17,Részarány!B17)","v":"Real costs*1"}]
[14,"Money granted to supplied people","Ellátottak pénzbeli juttatásai (K4)",51030.768486000001,4374.6632730000001,0.20780650836759207,39451.800000000003,39529.304272000001,3436.1522620000001,9.4553643609476962E-2,78.54666856778671,8.5725992431412497,8.7097477478847605,8.6926707294313488,{"$f":"+IF(zászlók!$A$20=1,Részarány!C18,Részarány!B18)","v":"Money granted to supplied people"}]
[null,"Other operation-purpose subsidies and expenditures ","Egyéb működési célú kiadások (K5)",3751064.7750710002,533269.65241099999,25.331527838926633,3937296.2666420001,4342859.7473769998,1285678.532202,35.378405978851049,241.09351177012144,14.216487434581992,32.653842767552668,29.604422131719176,{"$f":"+IF(zászlók!$A$20=1,Részarány!C19,Részarány!B19)","v":"Other operation-purpose subsidies and expenditures "}]
[21,"Investments*2","Beruházások (K6)",1333601.8642829999,27087.718377000001,1.2867285604153123,642211.26840900001,1132779.9890699999,25040.213514999999,0.68903914730031202,92.441205887098548,2.0311698043076367,3.899061686823726,2.2105098745218608,{"$f":"+IF(zászlók!$A$20=1,Részarány!C20,Részarány!B20)","v":"Investments*2"}]
{"$rows_left_out":35}